{"text_format":"1","workbook":"xlsx","n_sheets":2,"sheets":["Sheet1","週間生産予定表"],"not_rendered":{"charts":0,"images":0,"macros":1,"external_links":1,"defined_names":0,"comments":1,"pivot_tables":0},"unopened":[],"bounds":{"document_bytes":16777216,"sheet_cells":100000,"rows_first":2000,"rows_last":500,"rows_between":2000,"halvings":0,"cell_chars":16384,"cell_head_chars":4096},"cells_cut":0,"cells_raw":0,"read":"whole","date_system":"1900"}

{"sheet":"Sheet1","index":0,"n_rows":74,"n_cols":62,"rows_kept":74,"cut":false,"hidden":false,"merged":[[69,15,70,23],[73,15,74,23],[71,0,74,0],[71,1,72,1],[71,2,72,8],[71,12,72,13],[71,14,72,14],[71,15,72,23],[73,1,74,1],[73,2,74,8],[73,12,74,13],[73,14,74,14],[63,15,64,23],[67,0,70,0],[67,1,68,1],[67,2,68,8],[67,12,68,13],[67,14,68,14],[65,1,66,1],[65,2,66,8],[65,12,66,13],[65,14,66,14],[65,15,66,23],[67,15,68,23],[69,1,70,1],[69,2,70,8],[69,12,70,13],[69,14,70,14],[63,0,66,0],[63,1,64,1],[63,2,64,8],[63,12,64,13],[63,14,64,14],[59,15,60,23],[61,1,62,1],[61,2,62,8],[61,12,62,13],[61,14,62,14],[61,15,62,23],[59,0,62,0],[59,1,60,1],[59,2,60,8],[59,12,60,13],[59,14,60,14],[53,37,54,46],[53,47,54,50],[55,0,58,0],[55,1,56,1],[55,2,56,8],[55,12,56,13],[55,14,56,14],[55,15,56,23],[57,1,58,1],[57,2,58,8],[51,0,54,0],[57,12,58,13],[57,14,58,14],[57,15,58,23],[51,15,52,23],[53,1,54,1],[53,2,54,8],[53,12,54,13],[53,14,54,14],[53,15,54,23],[51,1,52,1],[51,2,52,8],[51,12,52,13],[51,14,52,14],[45,1,46,8],[45,12,46,13],[45,14,46,14],[45,15,46,23],[47,0,50,0],[47,1,48,1],[47,2,48,8],[47,12,48,13],[47,14,48,14],[47,15,48,23],[49,1,50,1],[49,2,50,8],[49,12,50,13],[49,14,50,14],[49,15,50,23],[0,47,0,48],[2,0,7,0],[38,0,43,0],[0,3,0,4],[0,14,0,15],[0,25,0,26],[0,36,0,37],[8,0,13,0],[14,0,19,0],[20,0,25,0],[26,0,31,0],[32,0,37,0]]}
[null,null,null,null,null,"型","区",null,null,null,null,null,null,null,null,null,"型","区",null,null,null,null,null,null,null,null,null,"型","区",null,null,null,null,null,null,null,null,null,"型","区",null,null,null,null,null,null,null,null,null,"型","区"]
["月日","作業者","Ｈ","品名","成形数",null,null,"品名ｺｰﾄﾞ","備考","機械コード（非表示）","着手日（非表示）","手配番号（非表示）","作業者","Ｈ","品名","成形数",null,null,"品名ｺｰﾄﾞ","備考","機械コード（非表示）","着手日（非表示）","手配番号（非表示）","作業者","Ｈ","品名","成形数",null,null,"品名ｺｰﾄﾞ","備考","機械コード（非表示）","着手日（非表示）","手配番号（非表示）","作業者","Ｈ","品名","成形数",null,null,"品名ｺｰﾄﾞ","備考","機械コード（非表示）","着手日（非表示）","手配番号（非表示）","作業者","Ｈ","品名","成形数",null,null,"品名ｺｰﾄﾞ","備考","機械コード（非表示）","着手日（非表示）","手配番号（非表示）"]
[null,null,{"$f":"IF(E3<>\" \"&H3<>\" \",IFERROR(VLOOKUP(H3,[1]品目マスタ!$B$310:$C$944,2,FALSE),\"\"),\"\")","v":""},null,null,null,null,null,null,null,null,null,null,{"$f":"IF(P3<>\" \"&S3<>\" \",IFERROR(VLOOKUP(S3,[1]品目マスタ!$B$310:$C$944,2,FALSE),\"\"),\"\")","v":""},null,null,null,null,null,null,null,null,null,null,{"$f":"IF(AA3<>\" \"&AD3<>\" \",IFERROR(VLOOKUP(AD3,[1]品目マスタ!$B$310:$C$944,2,FALSE),\"\"),\"\")","v":""},null,null,null,null,null,null,null,null,null,null,{"$f":"IF(AL3<>\" \"&AO3<>\" \",IFERROR(VLOOKUP(AO3,[1]品目マスタ!$B$310:$C$944,2,FALSE),\"\"),\"\")","v":""},null,null,null,null,null,null,null,null,null,null,{"$f":"IF(AW3<>\" \"&AZ3<>\" \",IFERROR(VLOOKUP(AZ3,[1]品目マスタ!$B$310:$C$944,2,FALSE),\"\"),\"\")","v":""},null,null,null,null,null,null,null,null,null,{"$f":"B3&F3","v":""},{"$f":"M3&Q3","v":""},{"$f":"X3&AB3","v":""},{"$f":"AI3&AM3","v":""},{"$f":"AT3&AX3","v":""},{"$f":"COUNTIF(BE3:BE8,\"自動1\")+COUNTIF(BF3:BF8,\"自動1\")+COUNTIF(BG3:BG8,\"自動1\")+COUNTIF(BH3:BH8,\"自動1\")+COUNTIF(BI3:BI8,\"自動1\")","v":0}]
[null,null,{"$f":"IF(E4<>\" \"&H4<>\" \",IFERROR(VLOOKUP(H4,[1]品目マスタ!$B$310:$C$944,2,FALSE),\"\"),\"\")","v":""},null,null,null,null,null,null,null,null,null,null,{"$f":"IF(P4<>\" \"&S4<>\" \",IFERROR(VLOOKUP(S4,[1]品目マスタ!$B$310:$C$944,2,FALSE),\"\"),\"\")","v":""},null,null,null,null,null,null,null,null,null,null,{"$f":"IF(AA4<>\" \"&AD4<>\" \",IFERROR(VLOOKUP(AD4,[1]品目マスタ!$B$310:$C$944,2,FALSE),\"\"),\"\")","v":""},null,null,null,null,null,null,null,null,null,null,{"$f":"IF(AL4<>\" \"&AO4<>\" \",IFERROR(VLOOKUP(AO4,[1]品目マスタ!$B$310:$C$944,2,FALSE),\"\"),\"\")","v":""},null,null,null,null,null,null,null,null,null,null,{"$f":"IF(AW4<>\" \"&AZ4<>\" \",IFERROR(VLOOKUP(AZ4,[1]品目マスタ!$B$310:$C$944,2,FALSE),\"\"),\"\")","v":""},null,null,null,null,null,null,null,null,null,{"$f":"B4&F4","v":""},{"$f":"M4&Q4","v":""},{"$f":"X4&AB4","v":""},{"$f":"AI4&AM4","v":""},{"$f":"AT4&AX4","v":""}]
[null,null,{"$f":"IF(E5<>\" \"&H5<>\" \",IFERROR(VLOOKUP(H5,[1]品目マスタ!$B$310:$C$944,2,FALSE),\"\"),\"\")","v":""},null,null,null,null,null,null,null,null,null,null,{"$f":"IF(P5<>\" \"&S5<>\" \",IFERROR(VLOOKUP(S5,[1]品目マスタ!$B$310:$C$944,2,FALSE),\"\"),\"\")","v":""},null,null,null,null,null,null,null,null,null,null,{"$f":"IF(AA5<>\" \"&AD5<>\" \",IFERROR(VLOOKUP(AD5,[1]品目マスタ!$B$310:$C$944,2,FALSE),\"\"),\"\")","v":""},null,null,null,null,null,null,null,null,null,null,{"$f":"IF(AL5<>\" \"&AO5<>\" \",IFERROR(VLOOKUP(AO5,[1]品目マスタ!$B$310:$C$944,2,FALSE),\"\"),\"\")","v":""},null,null,null,null,null,null,null,null,null,null,{"$f":"IF(AW5<>\" \"&AZ5<>\" \",IFERROR(VLOOKUP(AZ5,[1]品目マスタ!$B$310:$C$944,2,FALSE),\"\"),\"\")","v":""},null,null,null,null,null,null,null,null,null,"","","","",""]
[null,null,{"$f":"IF(E6<>\" \"&H6<>\" \",IFERROR(VLOOKUP(H6,[1]品目マスタ!$B$310:$C$944,2,FALSE),\"\"),\"\")","v":""},null,null,null,null,null,null,null,null,null,null,{"$f":"IF(P6<>\" \"&S6<>\" \",IFERROR(VLOOKUP(S6,[1]品目マスタ!$B$310:$C$944,2,FALSE),\"\"),\"\")","v":""},null,null,null,null,null,null,null,null,null,null,{"$f":"IF(AA6<>\" \"&AD6<>\" \",IFERROR(VLOOKUP(AD6,[1]品目マスタ!$B$310:$C$944,2,FALSE),\"\"),\"\")","v":""},null,null,null,null,null,null,null,null,null,null,{"$f":"IF(AL6<>\" \"&AO6<>\" \",IFERROR(VLOOKUP(AO6,[1]品目マスタ!$B$310:$C$944,2,FALSE),\"\"),\"\")","v":""},null,null,null,null,null,null,null,null,null,null,{"$f":"IF(AW6<>\" \"&AZ6<>\" \",IFERROR(VLOOKUP(AZ6,[1]品目マスタ!$B$310:$C$944,2,FALSE),\"\"),\"\")","v":""},null,null,null,null,null,null,null,null,null,"","","","",""]
[null,null,{"$f":"IF(E7<>\" \"&H7<>\" \",IFERROR(VLOOKUP(H7,[1]品目マスタ!$B$310:$C$944,2,FALSE),\"\"),\"\")","v":""},null,null,null,null,null,null,null,null,null,null,{"$f":"IF(P7<>\" \"&S7<>\" \",IFERROR(VLOOKUP(S7,[1]品目マスタ!$B$310:$C$944,2,FALSE),\"\"),\"\")","v":""},null,null,null,null,null,null,null,null,null,null,{"$f":"IF(AA7<>\" \"&AD7<>\" \",IFERROR(VLOOKUP(AD7,[1]品目マスタ!$B$310:$C$944,2,FALSE),\"\"),\"\")","v":""},null,null,null,null,null,null,null,null,null,null,{"$f":"IF(AL7<>\" \"&AO7<>\" \",IFERROR(VLOOKUP(AO7,[1]品目マスタ!$B$310:$C$944,2,FALSE),\"\"),\"\")","v":""},null,null,null,null,null,null,null,null,null,null,{"$f":"IF(AW7<>\" \"&AZ7<>\" \",IFERROR(VLOOKUP(AZ7,[1]品目マスタ!$B$310:$C$944,2,FALSE),\"\"),\"\")","v":""},null,null,null,null,null,null,null,null,null,"","","","",""]
[null,null,{"$f":"IF(E8<>\" \"&H8<>\" \",IFERROR(VLOOKUP(H8,[1]品目マスタ!$B$310:$C$944,2,FALSE),\"\"),\"\")","v":""},null,null,null,null,null,null,null,null,null,null,{"$f":"IF(P8<>\" \"&S8<>\" \",IFERROR(VLOOKUP(S8,[1]品目マスタ!$B$310:$C$944,2,FALSE),\"\"),\"\")","v":""},null,null,null,null,null,null,null,null,null,null,{"$f":"IF(AA8<>\" \"&AD8<>\" \",IFERROR(VLOOKUP(AD8,[1]品目マスタ!$B$310:$C$944,2,FALSE),\"\"),\"\")","v":""},null,null,null,null,null,null,null,null,null,null,{"$f":"IF(AL8<>\" \"&AO8<>\" \",IFERROR(VLOOKUP(AO8,[1]品目マスタ!$B$310:$C$944,2,FALSE),\"\"),\"\")","v":""},null,null,null,null,null,null,null,null,null,null,{"$f":"IF(AW8<>\" \"&AZ8<>\" \",IFERROR(VLOOKUP(AZ8,[1]品目マスタ!$B$310:$C$944,2,FALSE),\"\"),\"\")","v":""},null,null,null,null,null,null,null,null,null,"","","","",""]
[null,null,{"$f":"IF(E9<>\" \"&H9<>\" \",IFERROR(VLOOKUP(H9,[1]品目マスタ!$B$310:$C$944,2,FALSE),\"\"),\"\")","v":""},null,null,null,null,null,null,null,null,null,null,{"$f":"IF(P9<>\" \"&S9<>\" \",IFERROR(VLOOKUP(S9,[1]品目マスタ!$B$310:$C$944,2,FALSE),\"\"),\"\")","v":""},null,null,null,null,null,null,null,null,null,null,{"$f":"IF(AA9<>\" \"&AD9<>\" \",IFERROR(VLOOKUP(AD9,[1]品目マスタ!$B$310:$C$944,2,FALSE),\"\"),\"\")","v":""},null,null,null,null,null,null,null,null,null,null,{"$f":"IF(AL9<>\" \"&AO9<>\" \",IFERROR(VLOOKUP(AO9,[1]品目マスタ!$B$310:$C$944,2,FALSE),\"\"),\"\")","v":""},null,null,null,null,null,null,null,null,null,null,{"$f":"IF(AW9<>\" \"&AZ9<>\" \",IFERROR(VLOOKUP(AZ9,[1]品目マスタ!$B$310:$C$944,2,FALSE),\"\"),\"\")","v":""},null,null,null,null,null,null,null,null,null,"","","","","",{"$f":"COUNTIF(BE9:BE14,\"自動1\")+COUNTIF(BF9:BF14,\"自動1\")+COUNTIF(BG9:BG14,\"自動1\")+COUNTIF(BH9:BH14,\"自動1\")+COUNTIF(BI9:BI14,\"自動1\")","v":0}]
[null,null,{"$f":"IF(E10<>\" \"&H10<>\" \",IFERROR(VLOOKUP(H10,[1]品目マスタ!$B$310:$C$944,2,FALSE),\"\"),\"\")","v":""},null,null,null,null,null,null,null,null,null,null,{"$f":"IF(P10<>\" \"&S10<>\" \",IFERROR(VLOOKUP(S10,[1]品目マスタ!$B$310:$C$944,2,FALSE),\"\"),\"\")","v":""},null,null,null,null,null,null,null,null,null,null,{"$f":"IF(AA10<>\" \"&AD10<>\" \",IFERROR(VLOOKUP(AD10,[1]品目マスタ!$B$310:$C$944,2,FALSE),\"\"),\"\")","v":""},null,null,null,null,null,null,null,null,null,null,{"$f":"IF(AL10<>\" \"&AO10<>\" \",IFERROR(VLOOKUP(AO10,[1]品目マスタ!$B$310:$C$944,2,FALSE),\"\"),\"\")","v":""},null,null,null,null,null,null,null,null,null,null,{"$f":"IF(AW10<>\" \"&AZ10<>\" \",IFERROR(VLOOKUP(AZ10,[1]品目マスタ!$B$310:$C$944,2,FALSE),\"\"),\"\")","v":""},null,null,null,null,null,null,null,null,null,"","","","",""]
[null,null,{"$f":"IF(E11<>\" \"&H11<>\" \",IFERROR(VLOOKUP(H11,[1]品目マスタ!$B$310:$C$944,2,FALSE),\"\"),\"\")","v":""},null,null,null,null,null,null,null,null,null,null,{"$f":"IF(P11<>\" \"&S11<>\" \",IFERROR(VLOOKUP(S11,[1]品目マスタ!$B$310:$C$944,2,FALSE),\"\"),\"\")","v":""},null,null,null,null,null,null,null,null,null,null,{"$f":"IF(AA11<>\" \"&AD11<>\" \",IFERROR(VLOOKUP(AD11,[1]品目マスタ!$B$310:$C$944,2,FALSE),\"\"),\"\")","v":""},null,null,null,null,null,null,null,null,null,null,{"$f":"IF(AL11<>\" \"&AO11<>\" \",IFERROR(VLOOKUP(AO11,[1]品目マスタ!$B$310:$C$944,2,FALSE),\"\"),\"\")","v":""},null,null,null,null,null,null,null,null,null,null,{"$f":"IF(AW11<>\" \"&AZ11<>\" \",IFERROR(VLOOKUP(AZ11,[1]品目マスタ!$B$310:$C$944,2,FALSE),\"\"),\"\")","v":""},null,null,null,null,null,null,null,null,null,"","","","",""]
[null,null,{"$f":"IF(E12<>\" \"&H12<>\" \",IFERROR(VLOOKUP(H12,[1]品目マスタ!$B$310:$C$944,2,FALSE),\"\"),\"\")","v":""},null,null,null,null,null,null,null,null,null,null,{"$f":"IF(P12<>\" \"&S12<>\" \",IFERROR(VLOOKUP(S12,[1]品目マスタ!$B$310:$C$944,2,FALSE),\"\"),\"\")","v":""},null,null,null,null,null,null,null,null,null,null,{"$f":"IF(AA12<>\" \"&AD12<>\" \",IFERROR(VLOOKUP(AD12,[1]品目マスタ!$B$310:$C$944,2,FALSE),\"\"),\"\")","v":""},null,null,null,null,null,null,null,null,null,null,{"$f":"IF(AL12<>\" \"&AO12<>\" \",IFERROR(VLOOKUP(AO12,[1]品目マスタ!$B$310:$C$944,2,FALSE),\"\"),\"\")","v":""},null,null,null,null,null,null,null,null,null,null,{"$f":"IF(AW12<>\" \"&AZ12<>\" \",IFERROR(VLOOKUP(AZ12,[1]品目マスタ!$B$310:$C$944,2,FALSE),\"\"),\"\")","v":""},null,null,null,null,null,null,null,null,null,"","","","",""]
[null,null,{"$f":"IF(E13<>\" \"&H13<>\" \",IFERROR(VLOOKUP(H13,[1]品目マスタ!$B$310:$C$944,2,FALSE),\"\"),\"\")","v":""},null,null,null,null,null,null,null,null,null,null,{"$f":"IF(P13<>\" \"&S13<>\" \",IFERROR(VLOOKUP(S13,[1]品目マスタ!$B$310:$C$944,2,FALSE),\"\"),\"\")","v":""},null,null,null,null,null,null,null,null,null,null,{"$f":"IF(AA13<>\" \"&AD13<>\" \",IFERROR(VLOOKUP(AD13,[1]品目マスタ!$B$310:$C$944,2,FALSE),\"\"),\"\")","v":""},null,null,null,null,null,null,null,null,null,null,{"$f":"IF(AL13<>\" \"&AO13<>\" \",IFERROR(VLOOKUP(AO13,[1]品目マスタ!$B$310:$C$944,2,FALSE),\"\"),\"\")","v":""},null,null,null,null,null,null,null,null,null,null,{"$f":"IF(AW13<>\" \"&AZ13<>\" \",IFERROR(VLOOKUP(AZ13,[1]品目マスタ!$B$310:$C$944,2,FALSE),\"\"),\"\")","v":""},null,null,null,null,null,null,null,null,null,"","","","",""]
[null,null,{"$f":"IF(E14<>\" \"&H14<>\" \",IFERROR(VLOOKUP(H14,[1]品目マスタ!$B$310:$C$944,2,FALSE),\"\"),\"\")","v":""},null,null,null,null,null,null,null,null,null,null,{"$f":"IF(P14<>\" \"&S14<>\" \",IFERROR(VLOOKUP(S14,[1]品目マスタ!$B$310:$C$944,2,FALSE),\"\"),\"\")","v":""},null,null,null,null,null,null,null,null,null,null,{"$f":"IF(AA14<>\" \"&AD14<>\" \",IFERROR(VLOOKUP(AD14,[1]品目マスタ!$B$310:$C$944,2,FALSE),\"\"),\"\")","v":""},null,null,null,null,null,null,null,null,null,null,{"$f":"IF(AL14<>\" \"&AO14<>\" \",IFERROR(VLOOKUP(AO14,[1]品目マスタ!$B$310:$C$944,2,FALSE),\"\"),\"\")","v":""},null,null,null,null,null,null,null,null,null,null,{"$f":"IF(AW14<>\" \"&AZ14<>\" \",IFERROR(VLOOKUP(AZ14,[1]品目マスタ!$B$310:$C$944,2,FALSE),\"\"),\"\")","v":""},null,null,null,null,null,null,null,null,null,"","","","",""]
[null,null,{"$f":"IF(E15<>\" \"&H15<>\" \",IFERROR(VLOOKUP(H15,[1]品目マスタ!$B$310:$C$944,2,FALSE),\"\"),\"\")","v":""},null,null,null,null,null,null,null,null,null,null,{"$f":"IF(P15<>\" \"&S15<>\" \",IFERROR(VLOOKUP(S15,[1]品目マスタ!$B$310:$C$944,2,FALSE),\"\"),\"\")","v":""},null,null,null,null,null,null,null,null,null,null,{"$f":"IF(AA15<>\" \"&AD15<>\" \",IFERROR(VLOOKUP(AD15,[1]品目マスタ!$B$310:$C$944,2,FALSE),\"\"),\"\")","v":""},null,null,null,null,null,null,null,null,null,null,{"$f":"IF(AL15<>\" \"&AO15<>\" \",IFERROR(VLOOKUP(AO15,[1]品目マスタ!$B$310:$C$944,2,FALSE),\"\"),\"\")","v":""},null,null,null,null,null,null,null,null,null,null,{"$f":"IF(AW15<>\" \"&AZ15<>\" \",IFERROR(VLOOKUP(AZ15,[1]品目マスタ!$B$310:$C$944,2,FALSE),\"\"),\"\")","v":""},null,null,null,null,null,null,null,null,null,"","","","","",{"$f":"COUNTIF(BE15:BE20,\"自動1\")+COUNTIF(BF15:BF20,\"自動1\")+COUNTIF(BG15:BG20,\"自動1\")+COUNTIF(BH15:BH20,\"自動1\")+COUNTIF(BI15:BI20,\"自動1\")","v":0}]
[null,null,{"$f":"IF(E16<>\" \"&H16<>\" \",IFERROR(VLOOKUP(H16,[1]品目マスタ!$B$310:$C$944,2,FALSE),\"\"),\"\")","v":""},null,null,null,null,null,null,null,null,null,null,{"$f":"IF(P16<>\" \"&S16<>\" \",IFERROR(VLOOKUP(S16,[1]品目マスタ!$B$310:$C$944,2,FALSE),\"\"),\"\")","v":""},null,null,null,null,null,null,null,null,null,null,{"$f":"IF(AA16<>\" \"&AD16<>\" \",IFERROR(VLOOKUP(AD16,[1]品目マスタ!$B$310:$C$944,2,FALSE),\"\"),\"\")","v":""},null,null,null,null,null,null,null,null,null,null,{"$f":"IF(AL16<>\" \"&AO16<>\" \",IFERROR(VLOOKUP(AO16,[1]品目マスタ!$B$310:$C$944,2,FALSE),\"\"),\"\")","v":""},null,null,null,null,null,null,null,null,null,null,{"$f":"IF(AW16<>\" \"&AZ16<>\" \",IFERROR(VLOOKUP(AZ16,[1]品目マスタ!$B$310:$C$944,2,FALSE),\"\"),\"\")","v":""},null,null,null,null,null,null,null,null,null,"","","","",""]
[null,null,{"$f":"IF(E17<>\" \"&H17<>\" \",IFERROR(VLOOKUP(H17,[1]品目マスタ!$B$310:$C$944,2,FALSE),\"\"),\"\")","v":""},null,null,null,null,null,null,null,null,null,null,{"$f":"IF(P17<>\" \"&S17<>\" \",IFERROR(VLOOKUP(S17,[1]品目マスタ!$B$310:$C$944,2,FALSE),\"\"),\"\")","v":""},null,null,null,null,null,null,null,null,null,null,{"$f":"IF(AA17<>\" \"&AD17<>\" \",IFERROR(VLOOKUP(AD17,[1]品目マスタ!$B$310:$C$944,2,FALSE),\"\"),\"\")","v":""},null,null,null,null,null,null,null,null,null,null,{"$f":"IF(AL17<>\" \"&AO17<>\" \",IFERROR(VLOOKUP(AO17,[1]品目マスタ!$B$310:$C$944,2,FALSE),\"\"),\"\")","v":""},null,null,null,null,null,null,null,null,null,null,{"$f":"IF(AW17<>\" \"&AZ17<>\" \",IFERROR(VLOOKUP(AZ17,[1]品目マスタ!$B$310:$C$944,2,FALSE),\"\"),\"\")","v":""},null,null,null,null,null,null,null,null,null,"","","","",""]
[null,null,{"$f":"IF(E18<>\" \"&H18<>\" \",IFERROR(VLOOKUP(H18,[1]品目マスタ!$B$310:$C$944,2,FALSE),\"\"),\"\")","v":""},null,null,null,null,null,null,null,null,null,null,{"$f":"IF(P18<>\" \"&S18<>\" \",IFERROR(VLOOKUP(S18,[1]品目マスタ!$B$310:$C$944,2,FALSE),\"\"),\"\")","v":""},null,null,null,null,null,null,null,null,null,null,{"$f":"IF(AA18<>\" \"&AD18<>\" \",IFERROR(VLOOKUP(AD18,[1]品目マスタ!$B$310:$C$944,2,FALSE),\"\"),\"\")","v":""},null,null,null,null,null,null,null,null,null,null,{"$f":"IF(AL18<>\" \"&AO18<>\" \",IFERROR(VLOOKUP(AO18,[1]品目マスタ!$B$310:$C$944,2,FALSE),\"\"),\"\")","v":""},null,null,null,null,null,null,null,null,null,null,{"$f":"IF(AW18<>\" \"&AZ18<>\" \",IFERROR(VLOOKUP(AZ18,[1]品目マスタ!$B$310:$C$944,2,FALSE),\"\"),\"\")","v":""},null,null,null,null,null,null,null,null,null,"","","","",""]
[null,null,{"$f":"IF(E19<>\" \"&H19<>\" \",IFERROR(VLOOKUP(H19,[1]品目マスタ!$B$310:$C$944,2,FALSE),\"\"),\"\")","v":""},null,null,null,null,null,null,null,null,null,null,{"$f":"IF(P19<>\" \"&S19<>\" \",IFERROR(VLOOKUP(S19,[1]品目マスタ!$B$310:$C$944,2,FALSE),\"\"),\"\")","v":""},null,null,null,null,null,null,null,null,null,null,{"$f":"IF(AA19<>\" \"&AD19<>\" \",IFERROR(VLOOKUP(AD19,[1]品目マスタ!$B$310:$C$944,2,FALSE),\"\"),\"\")","v":""},null,null,null,null,null,null,null,null,null,null,{"$f":"IF(AL19<>\" \"&AO19<>\" \",IFERROR(VLOOKUP(AO19,[1]品目マスタ!$B$310:$C$944,2,FALSE),\"\"),\"\")","v":""},null,null,null,null,null,null,null,null,null,null,{"$f":"IF(AW19<>\" \"&AZ19<>\" \",IFERROR(VLOOKUP(AZ19,[1]品目マスタ!$B$310:$C$944,2,FALSE),\"\"),\"\")","v":""},null,null,null,null,null,null,null,null,null,"","","","",""]
[null,null,{"$f":"IF(E20<>\" \"&H20<>\" \",IFERROR(VLOOKUP(H20,[1]品目マスタ!$B$310:$C$944,2,FALSE),\"\"),\"\")","v":""},null,null,null,null,null,null,null,null,null,null,{"$f":"IF(P20<>\" \"&S20<>\" \",IFERROR(VLOOKUP(S20,[1]品目マスタ!$B$310:$C$944,2,FALSE),\"\"),\"\")","v":""},null,null,null,null,null,null,null,null,null,null,{"$f":"IF(AA20<>\" \"&AD20<>\" \",IFERROR(VLOOKUP(AD20,[1]品目マスタ!$B$310:$C$944,2,FALSE),\"\"),\"\")","v":""},null,null,null,null,null,null,null,null,null,null,{"$f":"IF(AL20<>\" \"&AO20<>\" \",IFERROR(VLOOKUP(AO20,[1]品目マスタ!$B$310:$C$944,2,FALSE),\"\"),\"\")","v":""},null,null,null,null,null,null,null,null,null,null,{"$f":"IF(AW20<>\" \"&AZ20<>\" \",IFERROR(VLOOKUP(AZ20,[1]品目マスタ!$B$310:$C$944,2,FALSE),\"\"),\"\")","v":""},null,null,null,null,null,null,null,null,null,"","","","",""]
[null,null,{"$f":"IF(E21<>\" \"&H21<>\" \",IFERROR(VLOOKUP(H21,[1]品目マスタ!$B$310:$C$944,2,FALSE),\"\"),\"\")","v":""},null,null,null,null,null,null,null,null,null,null,{"$f":"IF(P21<>\" \"&S21<>\" \",IFERROR(VLOOKUP(S21,[1]品目マスタ!$B$310:$C$944,2,FALSE),\"\"),\"\")","v":""},null,null,null,null,null,null,null,null,null,null,{"$f":"IF(AA21<>\" \"&AD21<>\" \",IFERROR(VLOOKUP(AD21,[1]品目マスタ!$B$310:$C$944,2,FALSE),\"\"),\"\")","v":""},null,null,null,null,null,null,null,null,null,null,{"$f":"IF(AL21<>\" \"&AO21<>\" \",IFERROR(VLOOKUP(AO21,[1]品目マスタ!$B$310:$C$944,2,FALSE),\"\"),\"\")","v":""},null,null,null,null,null,null,null,null,null,null,{"$f":"IF(AW21<>\" \"&AZ21<>\" \",IFERROR(VLOOKUP(AZ21,[1]品目マスタ!$B$310:$C$944,2,FALSE),\"\"),\"\")","v":""},null,null,null,null,null,null,null,null,null,"","","","","",{"$f":"COUNTIF(BE21:BE26,\"自動1\")+COUNTIF(BF21:BF26,\"自動1\")+COUNTIF(BG21:BG26,\"自動1\")+COUNTIF(BH21:BH26,\"自動1\")+COUNTIF(BI21:BI26,\"自動1\")","v":0}]
[null,null,{"$f":"IF(E22<>\" \"&H22<>\" \",IFERROR(VLOOKUP(H22,[1]品目マスタ!$B$310:$C$944,2,FALSE),\"\"),\"\")","v":""},null,null,null,null,null,null,null,null,null,null,{"$f":"IF(P22<>\" \"&S22<>\" \",IFERROR(VLOOKUP(S22,[1]品目マスタ!$B$310:$C$944,2,FALSE),\"\"),\"\")","v":""},null,null,null,null,null,null,null,null,null,null,{"$f":"IF(AA22<>\" \"&AD22<>\" \",IFERROR(VLOOKUP(AD22,[1]品目マスタ!$B$310:$C$944,2,FALSE),\"\"),\"\")","v":""},null,null,null,null,null,null,null,null,null,null,{"$f":"IF(AL22<>\" \"&AO22<>\" \",IFERROR(VLOOKUP(AO22,[1]品目マスタ!$B$310:$C$944,2,FALSE),\"\"),\"\")","v":""},null,null,null,null,null,null,null,null,null,null,{"$f":"IF(AW22<>\" \"&AZ22<>\" \",IFERROR(VLOOKUP(AZ22,[1]品目マスタ!$B$310:$C$944,2,FALSE),\"\"),\"\")","v":""},null,null,null,null,null,null,null,null,null,"","","","",""]
[null,null,{"$f":"IF(E23<>\" \"&H23<>\" \",IFERROR(VLOOKUP(H23,[1]品目マスタ!$B$310:$C$944,2,FALSE),\"\"),\"\")","v":""},null,null,null,null,null,null,null,null,null,null,{"$f":"IF(P23<>\" \"&S23<>\" \",IFERROR(VLOOKUP(S23,[1]品目マスタ!$B$310:$C$944,2,FALSE),\"\"),\"\")","v":""},null,null,null,null,null,null,null,null,null,null,{"$f":"IF(AA23<>\" \"&AD23<>\" \",IFERROR(VLOOKUP(AD23,[1]品目マスタ!$B$310:$C$944,2,FALSE),\"\"),\"\")","v":""},null,null,null,null,null,null,null,null,null,null,{"$f":"IF(AL23<>\" \"&AO23<>\" \",IFERROR(VLOOKUP(AO23,[1]品目マスタ!$B$310:$C$944,2,FALSE),\"\"),\"\")","v":""},null,null,null,null,null,null,null,null,null,null,{"$f":"IF(AW23<>\" \"&AZ23<>\" \",IFERROR(VLOOKUP(AZ23,[1]品目マスタ!$B$310:$C$944,2,FALSE),\"\"),\"\")","v":""},null,null,null,null,null,null,null,null,null,"","","","",""]
[null,null,{"$f":"IF(E24<>\" \"&H24<>\" \",IFERROR(VLOOKUP(H24,[1]品目マスタ!$B$310:$C$944,2,FALSE),\"\"),\"\")","v":""},null,null,null,null,null,null,null,null,null,null,{"$f":"IF(P24<>\" \"&S24<>\" \",IFERROR(VLOOKUP(S24,[1]品目マスタ!$B$310:$C$944,2,FALSE),\"\"),\"\")","v":""},null,null,null,null,null,null,null,null,null,null,{"$f":"IF(AA24<>\" \"&AD24<>\" \",IFERROR(VLOOKUP(AD24,[1]品目マスタ!$B$310:$C$944,2,FALSE),\"\"),\"\")","v":""},null,null,null,null,null,null,null,null,null,null,{"$f":"IF(AL24<>\" \"&AO24<>\" \",IFERROR(VLOOKUP(AO24,[1]品目マスタ!$B$310:$C$944,2,FALSE),\"\"),\"\")","v":""},null,null,null,null,null,null,null,null,null,null,{"$f":"IF(AW24<>\" \"&AZ24<>\" \",IFERROR(VLOOKUP(AZ24,[1]品目マスタ!$B$310:$C$944,2,FALSE),\"\"),\"\")","v":""},null,null,null,null,null,null,null,null,null,"","","","",""]
[null,null,{"$f":"IF(E25<>\" \"&H25<>\" \",IFERROR(VLOOKUP(H25,[1]品目マスタ!$B$310:$C$944,2,FALSE),\"\"),\"\")","v":""},null,null,null,null,null,null,null,null,null,null,{"$f":"IF(P25<>\" \"&S25<>\" \",IFERROR(VLOOKUP(S25,[1]品目マスタ!$B$310:$C$944,2,FALSE),\"\"),\"\")","v":""},null,null,null,null,null,null,null,null,null,null,{"$f":"IF(AA25<>\" \"&AD25<>\" \",IFERROR(VLOOKUP(AD25,[1]品目マスタ!$B$310:$C$944,2,FALSE),\"\"),\"\")","v":""},null,null,null,null,null,null,null,null,null,null,{"$f":"IF(AL25<>\" \"&AO25<>\" \",IFERROR(VLOOKUP(AO25,[1]品目マスタ!$B$310:$C$944,2,FALSE),\"\"),\"\")","v":""},null,null,null,null,null,null,null,null,null,null,{"$f":"IF(AW25<>\" \"&AZ25<>\" \",IFERROR(VLOOKUP(AZ25,[1]品目マスタ!$B$310:$C$944,2,FALSE),\"\"),\"\")","v":""},null,null,null,null,null,null,null,null,null,"","","","",""]
[null,null,{"$f":"IF(E26<>\" \"&H26<>\" \",IFERROR(VLOOKUP(H26,[1]品目マスタ!$B$310:$C$944,2,FALSE),\"\"),\"\")","v":""},null,null,null,null,null,null,null,null,null,null,{"$f":"IF(P26<>\" \"&S26<>\" \",IFERROR(VLOOKUP(S26,[1]品目マスタ!$B$310:$C$944,2,FALSE),\"\"),\"\")","v":""},null,null,null,null,null,null,null,null,null,null,{"$f":"IF(AA26<>\" \"&AD26<>\" \",IFERROR(VLOOKUP(AD26,[1]品目マスタ!$B$310:$C$944,2,FALSE),\"\"),\"\")","v":""},null,null,null,null,null,null,null,null,null,null,{"$f":"IF(AL26<>\" \"&AO26<>\" \",IFERROR(VLOOKUP(AO26,[1]品目マスタ!$B$310:$C$944,2,FALSE),\"\"),\"\")","v":""},null,null,null,null,null,null,null,null,null,null,{"$f":"IF(AW26<>\" \"&AZ26<>\" \",IFERROR(VLOOKUP(AZ26,[1]品目マスタ!$B$310:$C$944,2,FALSE),\"\"),\"\")","v":""},null,null,null,null,null,null,null,null,null,"","","","",""]
[null,null,{"$f":"IF(E27<>\" \"&H27<>\" \",IFERROR(VLOOKUP(H27,[1]品目マスタ!$B$310:$C$944,2,FALSE),\"\"),\"\")","v":""},null,null,null,null,null,null,null,null,null,null,{"$f":"IF(P27<>\" \"&S27<>\" \",IFERROR(VLOOKUP(S27,[1]品目マスタ!$B$310:$C$944,2,FALSE),\"\"),\"\")","v":""},null,null,null,null,null,null,null,null,null,null,{"$f":"IF(AA27<>\" \"&AD27<>\" \",IFERROR(VLOOKUP(AD27,[1]品目マスタ!$B$310:$C$944,2,FALSE),\"\"),\"\")","v":""},null,null,null,null,null,null,null,null,null,null,{"$f":"IF(AL27<>\" \"&AO27<>\" \",IFERROR(VLOOKUP(AO27,[1]品目マスタ!$B$310:$C$944,2,FALSE),\"\"),\"\")","v":""},null,null,null,null,null,null,null,null,null,null,{"$f":"IF(AW27<>\" \"&AZ27<>\" \",IFERROR(VLOOKUP(AZ27,[1]品目マスタ!$B$310:$C$944,2,FALSE),\"\"),\"\")","v":""},null,null,null,null,null,null,null,null,null,"","","","","",{"$f":"COUNTIF(BE27:BE32,\"自動1\")+COUNTIF(BF27:BF32,\"自動1\")+COUNTIF(BG27:BG32,\"自動1\")+COUNTIF(BH27:BH32,\"自動1\")+COUNTIF(BI27:BI32,\"自動1\")","v":0}]
[null,null,{"$f":"IF(E28<>\" \"&H28<>\" \",IFERROR(VLOOKUP(H28,[1]品目マスタ!$B$310:$C$944,2,FALSE),\"\"),\"\")","v":""},null,null,null,null,null,null,null,null,null,null,{"$f":"IF(P28<>\" \"&S28<>\" \",IFERROR(VLOOKUP(S28,[1]品目マスタ!$B$310:$C$944,2,FALSE),\"\"),\"\")","v":""},null,null,null,null,null,null,null,null,null,null,{"$f":"IF(AA28<>\" \"&AD28<>\" \",IFERROR(VLOOKUP(AD28,[1]品目マスタ!$B$310:$C$944,2,FALSE),\"\"),\"\")","v":""},null,null,null,null,null,null,null,null,null,null,{"$f":"IF(AL28<>\" \"&AO28<>\" \",IFERROR(VLOOKUP(AO28,[1]品目マスタ!$B$310:$C$944,2,FALSE),\"\"),\"\")","v":""},null,null,null,null,null,null,null,null,null,null,{"$f":"IF(AW28<>\" \"&AZ28<>\" \",IFERROR(VLOOKUP(AZ28,[1]品目マスタ!$B$310:$C$944,2,FALSE),\"\"),\"\")","v":""},null,null,null,null,null,null,null,null,null,"","","","",""]
[null,null,{"$f":"IF(E29<>\" \"&H29<>\" \",IFERROR(VLOOKUP(H29,[1]品目マスタ!$B$310:$C$944,2,FALSE),\"\"),\"\")","v":""},null,null,null,null,null,null,null,null,null,null,{"$f":"IF(P29<>\" \"&S29<>\" \",IFERROR(VLOOKUP(S29,[1]品目マスタ!$B$310:$C$944,2,FALSE),\"\"),\"\")","v":""},null,null,null,null,null,null,null,null,null,null,{"$f":"IF(AA29<>\" \"&AD29<>\" \",IFERROR(VLOOKUP(AD29,[1]品目マスタ!$B$310:$C$944,2,FALSE),\"\"),\"\")","v":""},null,null,null,null,null,null,null,null,null,null,{"$f":"IF(AL29<>\" \"&AO29<>\" \",IFERROR(VLOOKUP(AO29,[1]品目マスタ!$B$310:$C$944,2,FALSE),\"\"),\"\")","v":""},null,null,null,null,null,null,null,null,null,null,{"$f":"IF(AW29<>\" \"&AZ29<>\" \",IFERROR(VLOOKUP(AZ29,[1]品目マスタ!$B$310:$C$944,2,FALSE),\"\"),\"\")","v":""},null,null,null,null,null,null,null,null,null,"","","","",""]
[null,null,{"$f":"IF(E30<>\" \"&H30<>\" \",IFERROR(VLOOKUP(H30,[1]品目マスタ!$B$310:$C$944,2,FALSE),\"\"),\"\")","v":""},null,null,null,null,null,null,null,null,null,null,{"$f":"IF(P30<>\" \"&S30<>\" \",IFERROR(VLOOKUP(S30,[1]品目マスタ!$B$310:$C$944,2,FALSE),\"\"),\"\")","v":""},null,null,null,null,null,null,null,null,null,null,{"$f":"IF(AA30<>\" \"&AD30<>\" \",IFERROR(VLOOKUP(AD30,[1]品目マスタ!$B$310:$C$944,2,FALSE),\"\"),\"\")","v":""},null,null,null,null,null,null,null,null,null,null,{"$f":"IF(AL30<>\" \"&AO30<>\" \",IFERROR(VLOOKUP(AO30,[1]品目マスタ!$B$310:$C$944,2,FALSE),\"\"),\"\")","v":""},null,null,null,null,null,null,null,null,null,null,{"$f":"IF(AW30<>\" \"&AZ30<>\" \",IFERROR(VLOOKUP(AZ30,[1]品目マスタ!$B$310:$C$944,2,FALSE),\"\"),\"\")","v":""},null,null,null,null,null,null,null,null,null,"","","","",""]
{"$rows_left_out":45}
{"sheet":"週間生産予定表","index":1,"n_rows":0,"n_cols":0,"rows_kept":0,"cut":false,"hidden":false,"merged":[]}